BDBM47682 MLS000516682::N-[[4-(3,4-dimethoxyphenyl)-1,3-thiazol-2-yl]carbamothioyl]thiophene-2-carboxamide::N-[[4-(3,4-dimethoxyphenyl)thiazol-2-yl]thiocarbamoyl]thiophene-2-carboxamide::N-[[[4-(3,4-dimethoxyphenyl)-2-thiazolyl]amino]-sulfanylidenemethyl]-2-thiophenecarboxamide::SMR000342815::cid_2365274
SMILES COc1ccc(cc1OC)-c1csc(NC(=S)NC(=O)c2cccs2)n1
InChI Key InChIKey=HFIPUNBOEBEEST-UHFFFAOYSA-N
Data  1 IC50  2 EC50
  Tab Delimited (TSV)   2D SDfile   Computed 3D by Vconf -m prep SDfile
Find this compound or compounds like it in BindingDB:
Activity Spreadsheet -- Enzyme Inhibition Constant Data from BindingDB
Found 3 hits for monomerid = 47682
TargetGlutathione S-transferase Mu 1(Homo sapiens (Human))
Nmmlsc
Curated by PubChem BioAssay
LigandPNGBDBM47682(MLS000516682 | N-[[4-(3,4-dimethoxyphenyl)-1,3-thi...)
Affinity DataEC50:  1.33E+3nM. Assay description: University of New Mexico Assay Overview: Assay Support: NIH I RO3 MH081231-01 HTS to identify specific small molecule inhibitors of Ras and Ras-re...
Ligand InfoPC cidPC sid
In DepthDetails PCBioAssay
TargetStreptokinase A(Streptococcus pyogenes M1 GAS)
Broad Institute
Curated by PubChem BioAssay
LigandPNGBDBM47682(MLS000516682 | N-[[4-(3,4-dimethoxyphenyl)-1,3-thi...)
Affinity DataEC50:  1.50E+5nM. Assay description: Keywords: Group A streptococcus, GAS, streptokinase, expression, virulence, inhibition, dose response, EC50 Assay Overview: The goal of this assa...
Ligand InfoPC cidPC sid
In DepthDetails PCBioAssay
TargetInduced myeloid leukemia cell differentiation protein Mcl-1(Homo sapiens (Human))
Emory University
Curated by PubChem BioAssay
LigandPNGBDBM47682(MLS000516682 | N-[[4-(3,4-dimethoxyphenyl)-1,3-thi...)
Affinity DataIC50:  3.33E+3nM. Assay description: NIH Molecular Libraries Screening Centers Network [MLSCN] Emory Chemical Biology Discovery Center in MLSCN Assay provider: Nikolovska-Coleska, Univer...
Ligand InfoPC cidPC sid
In DepthDetails PCBioAssay