BDBM47685 MLS001002358::N-(2-methoxy-5-morpholin-4-ylsulfonyl-phenyl)-2-(2-nitropyridin-3-yl)oxy-ethanamide::N-(2-methoxy-5-morpholin-4-ylsulfonylphenyl)-2-(2-nitropyridin-3-yl)oxyacetamide::N-(2-methoxy-5-morpholinosulfonyl-phenyl)-2-[(2-nitro-3-pyridyl)oxy]acetamide::N-[2-methoxy-5-(4-morpholinylsulfonyl)phenyl]-2-[(2-nitro-3-pyridinyl)oxy]acetamide::SMR000368885::cid_3974867
SMILES COc1ccc(cc1NC(=O)COc1cccnc1[N+]([O-])=O)S(=O)(=O)N1CCOCC1
InChI Key InChIKey=KFYIDMNEXCAYLX-UHFFFAOYSA-N
Data  1 EC50
  Tab Delimited (TSV)   2D SDfile   Computed 3D by Vconf -m prep SDfile
Find this compound or compounds like it in BindingDB:
Activity Spreadsheet -- Enzyme Inhibition Constant Data from BindingDB
Found 1 hit for monomerid = 47685
TargetGlutathione S-transferase Mu 1(Homo sapiens (Human))
Nmmlsc
Curated by PubChem BioAssay
LigandPNGBDBM47685(MLS001002358 | N-(2-methoxy-5-morpholin-4-ylsulfon...)
Affinity DataEC50:  6.40E+4nM. Assay description: University of New Mexico Assay Overview: Assay Support: NIH I RO3 MH081231-01 HTS to identify specific small molecule inhibitors of Ras and Ras-re...
In DepthDetails PCBioAssay