BDBM477611 N-[(4R)-1-(2-fluorophenyl)-4,5,6,7-tetrahydro-1H-indazol-4-yl]-5-methylpyridine-2-carboxamide::US10889564, Example 41
SMILES Cc1ccc(nc1)C(=O)N[C@@H]1CCCc2c1cnn2-c1ccccc1F
InChI Key InChIKey=PDAOIFFWCOJIQP-MRXNPFEDSA-N
Data  2 IC50
  Tab Delimited (TSV)   2D SDfile   Computed 3D by Vconf -m prep SDfile
Find this compound or compounds like it in BindingDB:
Activity Spreadsheet -- Enzyme Inhibition Constant Data from BindingDB
Found 2 hits for monomerid = 477611
TargetDihydroorotate dehydrogenase (quinone), mitochondrial(Homo sapiens (Human))
Karolinska Institutet
Curated by ChEMBL
LigandPNGBDBM477611(N-[(4R)-1-(2-fluorophenyl)-4,5,6,7-tetrahydro-1H-i...)
Affinity DataIC50:  55nM. Assay description: Inhibition of recombinant human DHODH using dihydroorotic acid as substrate measured for 68 mins by DCIP based colorimetric assay
Ligand InfoPC cidPC sid
In DepthDetails ArticlePubMed
TargetDihydroorotate dehydrogenase (quinone), mitochondrial(Homo sapiens (Human))
Karolinska Institutet
Curated by ChEMBL
LigandPNGBDBM477611(N-[(4R)-1-(2-fluorophenyl)-4,5,6,7-tetrahydro-1H-i...)
Affinity DataIC50:  78nM. Assay description: Assay B: Example compounds as described herein were dispensed with an acoustic liquid handler, Echo 550 (Labcyte) to a maximum volume of 50 nl per we...
Ligand InfoPC cidPC sid
In DepthDetails US Patent