BDBM477626 3-Chloro-1-(1-(5-(ethoxymethyl)-4-(6-methoxypyridin-3-yl)-4H-1,2,4-triazol-3-yl)azetidin-3-yl)-5-fluoro-1H-indole 4::US10889569, Example 10::US10889569, Example 4
SMILES COCc1nnc(N2CC(C2)n2cc(Cl)c3cc(F)ccc23)n1-c1ccc(OC)nc1
InChI Key InChIKey=JLEKZKXVEIHLHQ-UHFFFAOYSA-N
Data  4 IC50
  Tab Delimited (TSV)   2D SDfile   Computed 3D by Vconf -m prep SDfile
Find this compound or compounds like it in BindingDB:
Activity Spreadsheet -- Enzyme Inhibition Constant Data from BindingDB
Found 4 hits for monomerid = 477626
TargetVasopressin V1a receptor(Homo sapiens (Human))
Jiangsu Hengrui Medicine
US Patent
LigandPNGBDBM477626(3-Chloro-1-(1-(5-(ethoxymethyl)-4-(6-methoxypyridi...)
Affinity DataIC50:  2.30E+3nM. Assay description: V1aR: The inhibition effect of the compounds of the present invention on the activity of human V1 aR protein expressed in HEK293/human V1aR stably tr...
Ligand InfoPC cidPC sid
In DepthDetails US Patent
TargetVasopressin V2 receptor(Homo sapiens (Human))
Jiangsu Hengrui Medicine
US Patent
LigandPNGBDBM477626(3-Chloro-1-(1-(5-(ethoxymethyl)-4-(6-methoxypyridi...)
Affinity DataIC50:  2.07E+4nM. Assay description: V2R: The inhibition effect of the compounds of the present invention on the activity of human V2R protein expressed in HEK293/human V2R cells was det...
Ligand InfoPC cidPC sid
In DepthDetails US Patent
TargetVasopressin V1b receptor(Homo sapiens (Human))
Jiangsu Hengrui Medicine
US Patent
LigandPNGBDBM477626(3-Chloro-1-(1-(5-(ethoxymethyl)-4-(6-methoxypyridi...)
Affinity DataIC50:  1.24E+4nM. Assay description: V1bR: The inhibition effect of the compounds of the present invention on the activity of human V1bR protein expressed in HEK293/human V1bR cells was ...
Ligand InfoPC cidPC sid
In DepthDetails US Patent
TargetVasopressin V1a receptor(Homo sapiens (Human))
Jiangsu Hengrui Medicine
US Patent
LigandPNGBDBM477626(3-Chloro-1-(1-(5-(ethoxymethyl)-4-(6-methoxypyridi...)
Affinity DataIC50:  5.70E+3nM. Assay description: V1aR: The inhibition effect of the compounds of the present invention on the activity of human V1 aR protein expressed in HEK293/human V1aR stably tr...
Ligand InfoPC cidPC sid
In DepthDetails US Patent