BDBM477900 5-((3-((1S,5S,6S)-3-amino-1,5-bis(fluoromethyl)-2-thia-4-azabicyclo[4.1.0]hept-3-en-5-yl)-4-fluorophenyl)ethynyl)pyrazine-2-carbonitrile::US10889581, Example 103
SMILES NC1=N[C@@](CF)([C@@H]2C[C@]2(CF)S1)c1cc(ccc1F)C#Cc1cnc(cn1)C#N
InChI Key InChIKey=SFMCZNIJMMCWAL-MISYRCLQSA-N
Data  3 IC50
  Tab Delimited (TSV)   2D SDfile   Computed 3D by Vconf -m prep SDfile
Find this compound or compounds like it in BindingDB:
Activity Spreadsheet -- Enzyme Inhibition Constant Data from BindingDB
Found 3 hits for monomerid = 477900
TargetBeta-secretase 1(Homo sapiens (Human))
Amgen
US Patent
LigandPNGBDBM477900(5-((3-((1S,5S,6S)-3-amino-1,5-bis(fluoromethyl)-2-...)
Affinity DataIC50:  86nM. Assay description: The cDNAs for both human recombinant BACE1 and 2 with C-terminal 6-His Tags were cloned into transient protein expression vectors, which were subsequ...
Ligand InfoPC cidPC sid
In DepthDetails US Patent
TargetCathepsin D(Homo sapiens (Human))
Amgen
US Patent
LigandPNGBDBM477900(5-((3-((1S,5S,6S)-3-amino-1,5-bis(fluoromethyl)-2-...)
Affinity DataIC50:  2.29E+5nM. Assay description: Recombinant CatD was expressed in CHO cells. The assay buffer for CatD was 0.05 M citrate pH 3.5, 10% DMSO final, 5 mM CHAPS. The CatD enzyme (9 nM) ...
Ligand InfoPC cidPC sid
In DepthDetails US Patent
TargetBeta-secretase 2(Homo sapiens (Human))
Amgen
US Patent
LigandPNGBDBM477900(5-((3-((1S,5S,6S)-3-amino-1,5-bis(fluoromethyl)-2-...)
Affinity DataIC50:  1.59E+3nM. Assay description: The cDNAs for both human recombinant BACE1 and 2 with C-terminal 6-His Tags were cloned into transient protein expression vectors, which were subsequ...
Ligand InfoPC cidPC sid
In DepthDetails US Patent