BDBM478100 1-((3-(8-Cyano-3-fluoroindolizin-5-yl)pyridin-4-yl)thio)cyclobutane-1-carboxylic acid ::US10894038, Example 20
SMILES OC(=O)C1(CCC1)Sc1ccncc1-c1ccc(C#N)c2ccc(F)n12
InChI Key InChIKey=PKVIILQNHCJDMG-UHFFFAOYSA-N
Data  1 IC50
  Tab Delimited (TSV)   2D SDfile   Computed 3D by Vconf -m prep SDfile
Find this compound or compounds like it in BindingDB:
Activity Spreadsheet -- Enzyme Inhibition Constant Data from BindingDB
Found 1 hit for monomerid = 478100
TargetSolute carrier family 22 member 12(Homo sapiens (Human))
Shanghai Fochon Pharmaceutical
US Patent
LigandPNGBDBM478100(1-((3-(8-Cyano-3-fluoroindolizin-5-yl)pyridin-4-yl...)
Affinity DataIC50:  34nM. Assay description: HEK293-URAT1 cell Lines were donated by Japan Fuji Biomedical Research Institute. Negative control cell of HEK293 (MOCK cells) which was transfected ...
Ligand InfoPC cidPC sid
In DepthDetails US Patent