BDBM478232 US10894782, No 85
SMILES CN1CCN(CCNC(=O)OCC#Cc2ccc(OCc3nnc(SC4CCCC=C4)n3-c3cncc(Cl)c3)cc2C)CC1
InChI Key InChIKey=PDNSTGDJZIYIOY-UHFFFAOYSA-N
Data  1 IC50
  Tab Delimited (TSV)   2D SDfile   Computed 3D by Vconf -m prep SDfile
Find this compound or compounds like it in BindingDB:
Activity Spreadsheet -- Enzyme Inhibition Constant Data from BindingDB
Found 1 hit for monomerid = 478232
TargetTransitional endoplasmic reticulum ATPase(Homo sapiens (Human))
University Of Pittsburgh
US Patent
LigandPNGBDBM478232(US10894782, No 85)
Affinity DataIC50:  934nM. Assay description: Biomol Green (Enzo) is a bioluminescent, homogeneous assay that measures ADP formed from a biochemical reaction. Because of its high sensitivity, the...
Ligand InfoPC cidPC sid
In DepthDetails US Patent