BDBM478267 US10894782, No 120
SMILES CN1CCC(CC1)NC(=O)OCC#Cc1c(F)cc(OCc2nnc(SC3CCCC=C3)n2-c2cccnc2)cc1F
InChI Key InChIKey=JLJRMQXDMKAJCA-UHFFFAOYSA-N
Data  1 IC50
  Tab Delimited (TSV)   2D SDfile   Computed 3D by Vconf -m prep SDfile
Find this compound or compounds like it in BindingDB:
Activity Spreadsheet -- Enzyme Inhibition Constant Data from BindingDB
Found 1 hit for monomerid = 478267
TargetTransitional endoplasmic reticulum ATPase(Homo sapiens (Human))
University Of Pittsburgh
US Patent
LigandPNGBDBM478267(US10894782, No 120)
Affinity DataIC50:  12nM. Assay description: Biomol Green (Enzo) is a bioluminescent, homogeneous assay that measures ADP formed from a biochemical reaction. Because of its high sensitivity, the...
Ligand InfoPC cidPC sid
In DepthDetails US Patent