BDBM478709 1-(4-{(1R or 1S)-1-[2-({6-[6-(azetidin-1-yl)-5-methoxypyrimidin-4-yl]-1H-benzimidazol-2-yl}amino)pyridin-4-yl]ethyl}piperazin-1-yl)-3,3,3-trifluoropropan-1-one::US10894784, Example 111.03
SMILES COc1c(ncnc1-c1ccc2nc(Nc3cc(ccn3)C(C)N3CCN(CC3)C(=O)CC(F)(F)F)[nH]c2c1)N1CCC1
InChI Key
Data  1 IC50
  Tab Delimited (TSV)   2D SDfile   Computed 3D by Vconf -m prep SDfile
Find this compound or compounds like it in BindingDB:
Activity Spreadsheet -- Enzyme Inhibition Constant Data from BindingDB
Found 1 hit for monomerid = 478709
TargetSerine/threonine-protein kinase TBK1(Homo sapiens (Human))
Bayer Pharma Aktiengesellschaft
US Patent
LigandPNGBDBM478709(1-(4-{(1R or 1S)-1-[2-({6-[6-(azetidin-1-yl)-5-met...)
Affinity DataIC50:  1.40nM. Assay description: Recombinant full-length N-terminally His-tagged human TBK1, expressed in insect cells and purified by Ni-NTA affinity chromatography, was purchased f...
Ligand InfoPC cidPC sid
In DepthDetails US Patent