BDBM478720 US10894784, Example 116.02::cyclopropyl(4-{(1R or 1S)-1-[2-({6-[6-(3,3-difluoroazetidin-1-yl)pyrimidin-4-yl]-1H-benzimidazol-2-yl}amino)pyridin-4-yl]ethyl}piperazin-1-yl)methanone
SMILES CC(N1CCN(CC1)C(=O)C1CC1)c1ccnc(Nc2nc3ccc(cc3[nH]2)-c2cc(ncn2)N2CC(F)(F)C2)c1
InChI Key
Data  1 IC50
  Tab Delimited (TSV)   2D SDfile   Computed 3D by Vconf -m prep SDfile
Find this compound or compounds like it in BindingDB:
Activity Spreadsheet -- Enzyme Inhibition Constant Data from BindingDB
Found 1 hit for monomerid = 478720
TargetSerine/threonine-protein kinase TBK1(Homo sapiens (Human))
Bayer Pharma Aktiengesellschaft
US Patent
LigandPNGBDBM478720(US10894784, Example 116.02 | cyclopropyl(4-{(1R or...)
Affinity DataIC50:  0.760nM. Assay description: Recombinant full-length N-terminally His-tagged human TBK1, expressed in insect cells and purified by Ni-NTA affinity chromatography, was purchased f...
Ligand InfoPC cidPC sid
In DepthDetails US Patent