BDBM478782 (Isomer-1 of compound-35): 2-(1''-acryloyl-1'',2'',5'',6''-tetrahydro-[2,3''-bipyridin]- 5-yl)-N-(5-cyclopropyl-1H-pyrazol-3-yl)propanamide::US10894786, Comp. No 36::US10894786, Comp. No 37
SMILES CC(C(=O)Nc1cc([nH]n1)C1CC1)c1ccc(nc1)C1=CCCN(C1)C(=O)C=C
InChI Key
Data  4 IC50  1 Kd
  Tab Delimited (TSV)   2D SDfile   Computed 3D by Vconf -m prep SDfile
Find this compound or compounds like it in BindingDB:
Activity Spreadsheet -- Enzyme Inhibition Constant Data from BindingDB
Found 5 hits for monomerid = 478782
TargetCyclin-dependent kinase 12(Homo sapiens)
Aurigene Discovery Technologies
US Patent
LigandPNGBDBM478782((Isomer-1 of compound-35): 2-(1''-acryloyl-1'',2''...)
Affinity DataKd:  63nM. Assay description: Kinase-tagged T7 phage strains were grown in parallel in 24-well blocks in an E. coli host derived from the BL21 strain. E. coli were grown to log-ph...
Ligand InfoPC cidPC sid
In DepthDetails US Patent
TargetCyclin-dependent kinase 12(Homo sapiens)
Aurigene Discovery Technologies
US Patent
LigandPNGBDBM478782((Isomer-1 of compound-35): 2-(1''-acryloyl-1'',2''...)
Affinity DataIC50:  686nM. Assay description: The inhibitory activity of the test compounds was assessed by the LANCE TR-FRET assay, which detects the ATP-dependent phosphorylation of an ULight-4...
Ligand InfoPC cidPC sid
In DepthDetails US Patent
TargetCyclin-dependent kinase 13(Homo sapiens (Human))
Aurigene Discovery Technologies
US Patent
LigandPNGBDBM478782((Isomer-1 of compound-35): 2-(1''-acryloyl-1'',2''...)
Affinity DataIC50:  3nM. Assay description: LanthaScreen Eu Kinase Binding Assays are based on the binding and displacement of Alexa Fluor 647-labeled, ATP-competitive kinase inhibitor scaffold...
Ligand InfoPC cidPC sid
In DepthDetails US Patent
TargetCyclin-dependent kinase 12(Homo sapiens)
Aurigene Discovery Technologies
US Patent
LigandPNGBDBM478782((Isomer-1 of compound-35): 2-(1''-acryloyl-1'',2''...)
Affinity DataIC50:  29nM. Assay description: The inhibitory activity of the test compounds was assessed by the LANCE TR-FRET assay, which detects the ATP-dependent phosphorylation of an ULight-4...
Ligand InfoPC cidPC sid
In DepthDetails US Patent
TargetCyclin-dependent kinase 13(Homo sapiens (Human))
Aurigene Discovery Technologies
US Patent
LigandPNGBDBM478782((Isomer-1 of compound-35): 2-(1''-acryloyl-1'',2''...)
Affinity DataIC50:  153nM. Assay description: LanthaScreen Eu Kinase Binding Assays are based on the binding and displacement of Alexa Fluor 647-labeled, ATP-competitive kinase inhibitor scaffold...
Ligand InfoPC cidPC sid
In DepthDetails US Patent