BDBM478811 US10894784, Example 154.03
SMILES CC(C)Nc1cc(ncn1)-c1ccc2nc(Nc3cc(CN4CCN(CC4)C(=O)C4CC4)ccn3)[nH]c2c1
InChI Key InChIKey=UVTRBCLHAUFAMV-UHFFFAOYSA-N
Data  1 IC50
  Tab Delimited (TSV)   2D SDfile   Computed 3D by Vconf -m prep SDfile
Find this compound or compounds like it in BindingDB:
Activity Spreadsheet -- Enzyme Inhibition Constant Data from BindingDB
Found 1 hit for monomerid = 478811
TargetSerine/threonine-protein kinase TBK1(Homo sapiens (Human))
Bayer Pharma Aktiengesellschaft
US Patent
LigandPNGBDBM478811(US10894784, Example 154.03)
Affinity DataIC50:  1.40nM. Assay description: Recombinant full-length N-terminally His-tagged human TBK1, expressed in insect cells and purified by Ni-NTA affinity chromatography, was purchased f...
Ligand InfoPC cidPC sid
In DepthDetails US Patent