BDBM47885 3,3'-{[5-bromo-2-(carboxymethoxy)phenyl]methylene}bis(1H-indole-2-carboxylic acid)::3-[[5-bromanyl-2-(2-hydroxy-2-oxoethyloxy)phenyl]-(2-carboxy-1H-indol-3-yl)methyl]-1H-indole-2-carboxylic acid::3-[[5-bromo-2-(carboxymethoxy)phenyl]-(2-carboxy-1H-indol-3-yl)methyl]-1H-indole-2-carboxylic acid::MLS001000686::SMR000498119::cid_2966254
SMILES OC(=O)COc1ccc(Br)cc1C(c1c([nH]c2ccccc12)C(O)=O)c1c([nH]c2ccccc12)C(O)=O
InChI Key InChIKey=IBIRGJAOPBORGU-UHFFFAOYSA-N
Data  1 IC50
  Tab Delimited (TSV)   2D SDfile   Computed 3D by Vconf -m prep SDfile
Find this compound or compounds like it in BindingDB:
Activity Spreadsheet -- Enzyme Inhibition Constant Data from BindingDB
Found 1 hit for monomerid = 47885
Target3C-like protease(Avian infectious bronchitis virus)
The Scripps Research Institute Molecular Screening Center
Curated by PubChem BioAssay
LigandPNGBDBM47885(3,3'-{[5-bromo-2-(carboxymethoxy)phenyl]methyl...)
Affinity DataIC50: >5.96E+4nM. Assay description: Source (MLPCN Center Name): The Scripps Research Institute Molecular Screening Center (SRIMSC) Center Affiliation: The Scripps Research Institute (TS...
In DepthDetails PCBioAssay