BDBM478852 US10894784, Example 164.02
SMILES CC(N1CCN(CC1)C(=O)CC(F)(F)F)c1ccnc(Nc2nc3ccc(cc3[nH]2)-c2cc(ncn2)N2CC(C2)C(F)(F)F)c1
InChI Key
Data  1 IC50
  Tab Delimited (TSV)   2D SDfile   Computed 3D by Vconf -m prep SDfile
Find this compound or compounds like it in BindingDB:
Activity Spreadsheet -- Enzyme Inhibition Constant Data from BindingDB
Found 1 hit for monomerid = 478852
TargetSerine/threonine-protein kinase TBK1(Homo sapiens (Human))
Bayer Pharma Aktiengesellschaft
US Patent
LigandPNGBDBM478852(US10894784, Example 164.02)
Affinity DataIC50:  0.943nM. Assay description: Recombinant full-length N-terminally His-tagged human TBK1, expressed in insect cells and purified by Ni-NTA affinity chromatography, was purchased f...
Ligand InfoPC cidPC sid
In DepthDetails US Patent