BDBM478990 (R)-1-(5-(3-((5-chloropyrimidin-2- yl)amino)pyrrolidine-1- carbonyl)indolin-1-yl)prop-2-en-1- one::US10894788, Example 30::US10894788, Example 50::US11390618, Example 50
SMILES Clc1cnc(N[C@@H]2CCN(C2)C(=O)c2ccc3N(CCc3c2)C(=O)C=C)nc1
InChI Key InChIKey=DJRGJVZONOBLIE-MRXNPFEDSA-N
Data  4 IC50
  Tab Delimited (TSV)   2D SDfile   Computed 3D by Vconf -m prep SDfile
Find this compound or compounds like it in BindingDB:
Activity Spreadsheet -- Enzyme Inhibition Constant Data from BindingDB
Found 4 hits for monomerid = 478990
TargetCyclin-dependent kinase 12(Homo sapiens)
Kinnate Biopharma
US Patent
LigandPNGBDBM478990((R)-1-(5-(3-((5-chloropyrimidin-2- yl)amino)pyrrol...)
Affinity DataIC50: <100nM. Assay description: For the assays, 5 μl solution from each well of the compound dilution plates/10% DMSO were transferred into the assay plates. The final volume o...
Ligand InfoPC cidPC sid
In DepthDetails US Patent
TargetCyclin-K/Cyclin-dependent kinase 12(Homo sapiens (Human))
Kinnate Biopharma
US Patent
LigandPNGBDBM478990((R)-1-(5-(3-((5-chloropyrimidin-2- yl)amino)pyrrol...)
Affinity DataIC50: <100nM. Assay description: The IC50 profile of compounds was determined using one protein kinase in a customized, thiol free assay. IC50 values were measured by testing 10 conc...
Ligand InfoPC cidPC sid
In DepthDetails US Patent
TargetCyclin-K/Cyclin-dependent kinase 12(Homo sapiens (Human))
Kinnate Biopharma
US Patent
LigandPNGBDBM478990((R)-1-(5-(3-((5-chloropyrimidin-2- yl)amino)pyrrol...)
Affinity DataIC50: <100nM. Assay description: The IC50 profile of compounds was determined using one protein kinase in a customized, thiol free assay. IC50 values were measured by testing 10 conc...
Ligand InfoPC cidPC sid
In DepthDetails US Patent
TargetCyclin-dependent kinase 12(Homo sapiens)
Kinnate Biopharma
US Patent
LigandPNGBDBM478990((R)-1-(5-(3-((5-chloropyrimidin-2- yl)amino)pyrrol...)
Affinity DataIC50: <100nM. Assay description: For the assays, 5 μl solution from each well of the compound dilution plates/10% DMSO were transferred into the assay plates. The final volume o...
Ligand InfoPC cidPC sid
In DepthDetails US Patent