BDBM479082 (R,E)-N-(4-(3-((5-chloropyrimidin-2- yl)amino)pyrrolidine-1- carbonyl)benzyl)-4- (dimethylamino)but-2-enamide::US10894788, Example 122::US11390618, Example 122
SMILES CN(C)C\C=C\C(=O)NCc1ccc(cc1)C(=O)N1CC[C@H](C1)Nc1ncc(Cl)cn1
InChI Key InChIKey=IOYXTGHLDXDNGJ-GNAXCBTBSA-N
Data  2 IC50
  Tab Delimited (TSV)   2D SDfile   Computed 3D by Vconf -m prep SDfile
Find this compound or compounds like it in BindingDB:
Activity Spreadsheet -- Enzyme Inhibition Constant Data from BindingDB
Found 2 hits for monomerid = 479082
TargetCyclin-K/Cyclin-dependent kinase 12(Homo sapiens (Human))
Kinnate Biopharma
US Patent
LigandPNGBDBM479082((R,E)-N-(4-(3-((5-chloropyrimidin-2- yl)amino)pyrr...)
Affinity DataIC50:  2.00E+4nM. Assay description: The IC50 profile of test compounds was determined using three protein kinases. IC50 values were measured by testing 10 concentrations (1×10−04M...
Ligand InfoPC cidPC sid
In DepthDetails US Patent
TargetCyclin-dependent kinase 12(Homo sapiens)
Kinnate Biopharma
US Patent
LigandPNGBDBM479082((R,E)-N-(4-(3-((5-chloropyrimidin-2- yl)amino)pyrr...)
Affinity DataIC50:  6.50E+4nM. Assay description: The IC50 profile of compounds was determined using one protein kinase in a customized, thiol free assay. IC50 values were measured by testing 10 conc...
Ligand InfoPC cidPC sid
In DepthDetails US Patent