BDBM47917 2-amino-N-[3,5-bis(trifluoromethyl)phenyl]-5-bromo-3-pyridinesulfonamide::2-amino-N-[3,5-bis(trifluoromethyl)phenyl]-5-bromo-pyridine-3-sulfonamide::2-amino-N-[3,5-bis(trifluoromethyl)phenyl]-5-bromopyridine-3-sulfonamide::2-azanyl-N-[3,5-bis(trifluoromethyl)phenyl]-5-bromanyl-pyridine-3-sulfonamide::MLS001115638::SMR000626398::cid_22515899
SMILES Nc1ncc(Br)cc1S(=O)(=O)Nc1cc(cc(c1)C(F)(F)F)C(F)(F)F
InChI Key InChIKey=XHLHBFYLAOFYRN-UHFFFAOYSA-N
Data  4 IC50  1 EC50
  Tab Delimited (TSV)   2D SDfile   Computed 3D by Vconf -m prep SDfile
Find this compound or compounds like it in BindingDB:
Activity Spreadsheet -- Enzyme Inhibition Constant Data from BindingDB
Found 5 hits for monomerid = 47917
Target3C-like protease(Avian infectious bronchitis virus)
The Scripps Research Institute Molecular Screening Center
Curated by PubChem BioAssay
LigandPNGBDBM47917(2-amino-N-[3,5-bis(trifluoromethyl)phenyl]-5-bromo...)
Affinity DataIC50: >5.96E+4nM. Assay description: Source (MLPCN Center Name): The Scripps Research Institute Molecular Screening Center (SRIMSC) Center Affiliation: The Scripps Research Institute (TS...
Ligand InfoPC cidPC sid
In DepthDetails PCBioAssay
TargetStreptokinase A(Streptococcus pyogenes M1 GAS)
Broad Institute
Curated by PubChem BioAssay
LigandPNGBDBM47917(2-amino-N-[3,5-bis(trifluoromethyl)phenyl]-5-bromo...)
Affinity DataEC50:  3.32E+3nM. Assay description: Keywords: Group A streptococcus, GAS, streptokinase, expression, virulence, inhibition, dose response, EC50 Assay Overview: The goal of this assa...
Ligand InfoPC cidPC sid
In DepthDetails PCBioAssay
TargetHuntingtin(Homo sapiens (Human))
The Scripps Research Institute Molecular Screening Center
Curated by PubChem BioAssay
LigandPNGBDBM47917(2-amino-N-[3,5-bis(trifluoromethyl)phenyl]-5-bromo...)
Affinity DataIC50:  2.49E+3nM
Ligand InfoPC cidPC sid
In DepthDetails PCBioAssay
TargetPhospholipase A2(Homo sapiens (Human))
Burnham Center For Chemical Genomics
Curated by PubChem BioAssay
LigandPNGBDBM47917(2-amino-N-[3,5-bis(trifluoromethyl)phenyl]-5-bromo...)
Affinity DataIC50:  8.69E+3nM. Assay description: Data Source: Sanford-Burnham Center for Chemical Genomics (SBCCG) Source Affiliation: Sanford-Burnham Medical Research Institute (SBMRI, San Diego, C...
Ligand InfoPC cidPC sid
In DepthDetails PCBioAssay
TargetCysteine protease ATG4B(Homo sapiens (Human))
Burnham Center For Chemical Genomics
Curated by PubChem BioAssay
LigandPNGBDBM47917(2-amino-N-[3,5-bis(trifluoromethyl)phenyl]-5-bromo...)
Affinity DataIC50:  8.94E+3nM. Assay description: Data Source: Sanford-Burnham Center for Chemical Genomics (SBCCG) Source Affiliation: Sanford-Burnham Medical Research Institute (SBMRI, San Diego, C...
Ligand InfoPC cidPC sid
In DepthDetails PCBioAssay