BDBM479468 US10894807, ID P291
SMILES OC(=O)CCC(NC(=O)N[C@@H](Cc1ccc(NC(=O)CCC(CCC(=O)Nc2ccc(C[C@H](NC(=O)NC(CCC(O)=O)C(O)=O)C(O)=O)cc2)(CCC(=O)Nc2ccc(C[C@H](NC(=O)NC(CCC(O)=O)C(O)=O)C(O)=O)cc2)NC(=O)Cn2cc(CCCF)nn2)cc1)C(O)=O)C(O)=O
InChI Key InChIKey=ALAMVTIVYQFASO-DGQSLVGCSA-N
Data  1 KI
  Tab Delimited (TSV)   2D SDfile   Computed 3D by Vconf -m prep SDfile
Find this compound or compounds like it in BindingDB:
Activity Spreadsheet -- Enzyme Inhibition Constant Data from BindingDB
Found 1 hit for monomerid = 479468
TargetGlutamate carboxypeptidase 2(Homo sapiens (Human))
Siemens Medical Solutions Usa
US Patent
LigandPNGBDBM479468(US10894807, ID P291)
Affinity DataKi:  5nM. Assay description: The inhibitory activity of all compounds was determined using a fluorescent assay of human PSMA activity. The enzyme used in the assay was purchased ...
Ligand InfoPC cidPC sid
In DepthDetails US Patent