BDBM479506 3-amino-6-(1-methyl-6-oxo-1,6- dihydropyridin-3-yl)-N- ((5-methylthiazol-4- yl)methyl)-5-(oxazol-2-yl)pyrazine-2- carboxamide::US10898481, Compound 22::US11571420, Compound 22
SMILES Cc1scnc1CNC(=O)c1nc(-c2ccc(=O)n(C)c2)c(nc1N)-c1ncco1
InChI Key InChIKey=HTZLJSHCLMBGCS-UHFFFAOYSA-N
Data  2 IC50
  Tab Delimited (TSV)   2D SDfile   Computed 3D by Vconf -m prep SDfile
Find this compound or compounds like it in BindingDB:
Activity Spreadsheet -- Enzyme Inhibition Constant Data from BindingDB
Found 2 hits for monomerid = 479506
TargetAdenosine receptor A2a(Homo sapiens (Human))
Dizal (Jiangsu) Pharmaceutical
US Patent
LigandPNGBDBM479506(3-amino-6-(1-methyl-6-oxo-1,6- dihydropyridin-3-yl...)
Affinity DataIC50:  3.5nM. Assay description: Binding affinity and specificalities of the compounds against different subtype of human adenosine receptors (hA1, hA2a, hA2b, and hA3) were characte...
Ligand InfoPC cidPC sid
In DepthDetails US Patent
TargetAdenosine receptor A2a(Homo sapiens (Human))
Dizal (Jiangsu) Pharmaceutical
US Patent
LigandPNGBDBM479506(3-amino-6-(1-methyl-6-oxo-1,6- dihydropyridin-3-yl...)
Affinity DataIC50:  3.5nM. Assay description: The compounds at different concentrations were incubate with hA1 membrane (from PerkinElmer) and [3H]-8-Cyclopentyl-1,3-dipropylxanthine (DPCPX) for ...
Ligand InfoPC cidPC sid
In DepthDetails US Patent