BDBM48047 3-amino-N-(3-chlorobenzyl)-4,6-dimethyl-thieno[2,3-b]pyridine-2-carboxamide::3-amino-N-[(3-chlorophenyl)methyl]-4,6-dimethyl-2-thieno[2,3-b]pyridinecarboxamide::3-amino-N-[(3-chlorophenyl)methyl]-4,6-dimethylthieno[2,3-b]pyridine-2-carboxamide::3-azanyl-N-[(3-chlorophenyl)methyl]-4,6-dimethyl-thieno[2,3-b]pyridine-2-carboxamide::VU0402472-1::cid_24769768
SMILES Cc1cc(C)c2c(N)c(sc2n1)C(=O)NCc1cccc(Cl)c1
InChI Key InChIKey=AFSCHWFNLCBXCW-UHFFFAOYSA-N
Data  1 EC50
  Tab Delimited (TSV)   2D SDfile   Computed 3D by Vconf -m prep SDfile
Find this compound or compounds like it in BindingDB:
Activity Spreadsheet -- Enzyme Inhibition Constant Data from BindingDB
Found 1 hit for monomerid = 48047
TargetMuscarinic acetylcholine receptor M4(RAT)
Vanderbilt Screening Center For Gpcrs, Ion Channels And Transporters
Curated by PubChem BioAssay
LigandPNGBDBM48047(3-amino-N-(3-chlorobenzyl)-4,6-dimethyl-thieno[2,3...)
Affinity DataEC50:  0.00903nM. Assay description: Assay Provider: Colleen Niswender Assay Provider Affiliation: Vanderbilt University Grant Title: Discovery of a Highly Selective in vitro and in vivo...
In DepthDetails PCBioAssay