BDBM48068 3-amino-6-[3-(dimethylamino)propoxy]-4-methyl-N-(3-oxetanyl)-2-thieno[2,3-b]pyridinecarboxamide::3-amino-6-[3-(dimethylamino)propoxy]-4-methyl-N-(oxetan-3-yl)thieno[2,3-b]pyridine-2-carboxamide::3-azanyl-6-[3-(dimethylamino)propoxy]-4-methyl-N-(oxetan-3-yl)thieno[2,3-b]pyridine-2-carboxamide::VU0359439::cid_45142477
SMILES CN(C)CCCOc1cc(C)c2c(N)c(sc2n1)C(=O)NC1COC1
InChI Key InChIKey=QQUFHIAWHGKEGL-UHFFFAOYSA-N
Data  1 EC50
  Tab Delimited (TSV)   2D SDfile   Computed 3D by Vconf -m prep SDfile
Find this compound or compounds like it in BindingDB:
Activity Spreadsheet -- Enzyme Inhibition Constant Data from BindingDB
Found 1 hit for monomerid = 48068
TargetMuscarinic acetylcholine receptor M4(RAT)
Vanderbilt Screening Center For Gpcrs, Ion Channels And Transporters
Curated by PubChem BioAssay
LigandPNGBDBM48068(3-amino-6-[3-(dimethylamino)propoxy]-4-methyl-N-(3...)
Affinity DataEC50:  2.58E+3nM. Assay description: Assay Provider: Colleen Niswender Assay Provider Affiliation: Vanderbilt University Grant Title: Discovery of a Highly Selective in vitro and in vivo...
In DepthDetails PCBioAssay