BDBM480774 US10905687, Compound 50::US20230277527, Compound 50
SMILES Cc1cc(CN2CCN(Cc3ccncc3)[C@@H](CC(O)=O)C2)ccc1-c1ccc(cc1)C(O)(C(F)(F)F)C(F)(F)F
InChI Key InChIKey=DNRQYNYSRNRKME-DEOSSOPVSA-N
Data  2 IC50
  Tab Delimited (TSV)   2D SDfile   Computed 3D by Vconf -m prep SDfile
Find this compound or compounds like it in BindingDB:
Activity Spreadsheet -- Enzyme Inhibition Constant Data from BindingDB
Found 2 hits for monomerid = 480774
TargetNuclear receptor ROR-gamma(Homo sapiens (Human))
Escalier Biosciences
US Patent
LigandPNGBDBM480774(US10905687, Compound 50 | US20230277527, Compound ...)
Affinity DataIC50:  5.50E+3nM. Assay description: Human RORγ ligand binding assay was performed in 96-well format. The N-terminal DNA binding domains (DBD) of the native RORγ and RORγt...
Ligand InfoPC cidPC sid
In DepthDetails US Patent
TargetNuclear receptor ROR-gamma(Homo sapiens (Human))
Escalier Biosciences
US Patent
LigandPNGBDBM480774(US10905687, Compound 50 | US20230277527, Compound ...)
Affinity DataIC50:  5.50E+3nM. Assay description: Human RORγ ligand binding assay was performed in 96-well format. The N-terminal DNA binding domains (DBD) of the native RORγ and RORγt...
Ligand InfoPC cidPC sid
In DepthDetails US Patent