BDBM480845 US10906888, Example 61
SMILES OC[C@@]12CN(CC1CCCC2)C(=O)c1cnc(NC2(CC2)c2cncnc2)nc1
InChI Key InChIKey=RPXJDXIXUWDEDJ-OTOKDRCRSA-N
Data  1 IC50
  Tab Delimited (TSV)   2D SDfile   Computed 3D by Vconf -m prep SDfile
Find this compound or compounds like it in BindingDB:
Activity Spreadsheet -- Enzyme Inhibition Constant Data from BindingDB
Found 1 hit for monomerid = 480845
TargetPantetheinase(Homo sapiens (Human))
Pfizer
US Patent
LigandPNGBDBM480845(US10906888, Example 61)
Affinity DataIC50:  2.51nM. Assay description: The test inhibitors were solubilized in DMSO to a stock concentration of 30 mM. On the day of the assay, dose response plates were prepared by diluti...
Ligand InfoPC cidPC sid
In DepthDetails US Patent