BDBM480942 US10906888, Example 159
SMILES CC(Nc1ncc(cn1)C(=O)N1CCC2(C1)CCOCC2)c1cnc(C)nc1
InChI Key InChIKey=UIEOYUSFSVKBRT-UHFFFAOYSA-N
Data  1 IC50
  Tab Delimited (TSV)   2D SDfile   Computed 3D by Vconf -m prep SDfile
Find this compound or compounds like it in BindingDB:
Activity Spreadsheet -- Enzyme Inhibition Constant Data from BindingDB
Found 1 hit for monomerid = 480942
TargetPantetheinase(Homo sapiens (Human))
Pfizer
US Patent
LigandPNGBDBM480942(US10906888, Example 159)
Affinity DataIC50:  1.29nM. Assay description: The test inhibitors were solubilized in DMSO to a stock concentration of 30 mM. On the day of the assay, dose response plates were prepared by diluti...
Ligand InfoPC cidPC sid
In DepthDetails US Patent