BDBM481012 US10906890, Example 21.0
SMILES COc1cccc(OC)c1-n1c(NS(=O)(=O)[C@H]2CCCN(C2)c2ncc(F)cn2)nnc1-c1ccccc1
InChI Key InChIKey=AFUKZQPTZMJSBV-IBGZPJMESA-N
Data  1 EC50
  Tab Delimited (TSV)   2D SDfile   Computed 3D by Vconf -m prep SDfile
Find this compound or compounds like it in BindingDB:
Activity Spreadsheet -- Enzyme Inhibition Constant Data from BindingDB
Found 1 hit for monomerid = 481012
TargetApelin receptor(Homo sapiens (Human))
Amgen
US Patent
LigandPNGBDBM481012(US10906890, Example 21.0)
Affinity DataEC50:  7.30nM. Assay description: The human APJ receptor was cloned by polymerase chain reaction and the gene encoding the receptor was subcloned in pFLAG-CMV™-3 expression vector (Si...
Ligand InfoPC cidPC sid
In DepthDetails US Patent