BDBM481018 US10906890, Example 27.0::US10906890, Example 28.0
SMILES COc1ncnc(OC)c1-n1c(NS(=O)(=O)[C@H]2CCCN(C2)c2ncc(F)cn2)nnc1-c1ccccc1
InChI Key InChIKey=DIIHRCSZVLPGBC-KRWDZBQOSA-N
Data  2 EC50
  Tab Delimited (TSV)   2D SDfile   Computed 3D by Vconf -m prep SDfile
Find this compound or compounds like it in BindingDB:
Activity Spreadsheet -- Enzyme Inhibition Constant Data from BindingDB
Found 2 hits for monomerid = 481018
TargetApelin receptor(Homo sapiens (Human))
Amgen
US Patent
LigandPNGBDBM481018(US10906890, Example 27.0 | US10906890, Example 28....)
Affinity DataEC50:  410nM. Assay description: The human APJ receptor was cloned by polymerase chain reaction and the gene encoding the receptor was subcloned in pFLAG-CMV™-3 expression vector (Si...
Ligand InfoPC cidPC sid
In DepthDetails US Patent
TargetApelin receptor(Homo sapiens (Human))
Amgen
US Patent
LigandPNGBDBM481018(US10906890, Example 27.0 | US10906890, Example 28....)
Affinity DataEC50:  32nM. Assay description: The human APJ receptor was cloned by polymerase chain reaction and the gene encoding the receptor was subcloned in pFLAG-CMV™-3 expression vector (Si...
Ligand InfoPC cidPC sid
In DepthDetails US Patent