BDBM481066 US10906890, Example 78.0
SMILES CO[C@@H]([C@H](C)S(=O)(=O)Nc1nnc(-c2ccc(C)cc2)n1-c1c(OC)cccc1OC)c1ncc(C)cn1
InChI Key InChIKey=NDMSXGOSSNSTCL-MBSDFSHPSA-N
Data  1 EC50
  Tab Delimited (TSV)   2D SDfile   Computed 3D by Vconf -m prep SDfile
Find this compound or compounds like it in BindingDB:
Activity Spreadsheet -- Enzyme Inhibition Constant Data from BindingDB
Found 1 hit for monomerid = 481066
TargetApelin receptor(Homo sapiens (Human))
Amgen
US Patent
LigandPNGBDBM481066(US10906890, Example 78.0)
Affinity DataEC50:  2.40nM. Assay description: The human APJ receptor was cloned by polymerase chain reaction and the gene encoding the receptor was subcloned in pFLAG-CMV™-3 expression vector (Si...
Ligand InfoPC cidPC sid
In DepthDetails US Patent