BDBM481074 US10906890, Example 86.0
SMILES CO[C@@H]([C@H](C)S(=O)(=O)Nc1nnc(-c2cccc(c2)C#N)n1-c1c(OC)cccc1OC)c1ncc(C)cn1
InChI Key InChIKey=QCLXQWCGIBHYKW-SBUREZEXSA-N
Data  1 EC50
  Tab Delimited (TSV)   2D SDfile   Computed 3D by Vconf -m prep SDfile
Find this compound or compounds like it in BindingDB:
Activity Spreadsheet -- Enzyme Inhibition Constant Data from BindingDB
Found 1 hit for monomerid = 481074
TargetApelin receptor(Homo sapiens (Human))
Amgen
US Patent
LigandPNGBDBM481074(US10906890, Example 86.0)
Affinity DataEC50:  10.6nM. Assay description: The human APJ receptor was cloned by polymerase chain reaction and the gene encoding the receptor was subcloned in pFLAG-CMV™-3 expression vector (Si...
Ligand InfoPC cidPC sid
In DepthDetails US Patent