BDBM48108 (4-acetamidophenyl) piperidine-1-carboxylate::1-piperidinecarboxylic acid (4-acetamidophenyl) ester::MLS000072045::Piperidine-1-carboxylic acid 4-acetylamino-phenyl ester::SMR000010814::cid_646724::piperidine-1-carboxylic acid (4-acetamidophenyl) ester
SMILES CC(=O)Nc1ccc(OC(=O)N2CCCCC2)cc1
InChI Key InChIKey=YSEVVXWMFVPJDE-UHFFFAOYSA-N
Data  1 IC50  1 EC50
  Tab Delimited (TSV)   2D SDfile   Computed 3D by Vconf -m prep SDfile
Find this compound or compounds like it in BindingDB:
Activity Spreadsheet -- Enzyme Inhibition Constant Data from BindingDB
Found 2 hits for monomerid = 48108
TargetEndothelial PAS domain-containing protein 1(Homo sapiens (Human))
Burnham Center For Chemical Genomics
Curated by PubChem BioAssay
LigandPNGBDBM48108((4-acetamidophenyl) piperidine-1-carboxylate | 1-p...)
Affinity DataIC50:  2.33E+3nM
In DepthDetails PCBioAssay
TargetMatrix metalloproteinase-14 [1-36](Homo sapiens (Human))
Sanford-Burnham Center For Chemical Genomics
Curated by PubChem BioAssay
LigandPNGBDBM48108((4-acetamidophenyl) piperidine-1-carboxylate | 1-p...)
Affinity DataEC50:  5.00E+4nM. Assay description: Data Source: Sanford-Burnham Center for Chemical Genomics (SBCCG) Source Affiliation: Sanford-Burnham Medical Research Institute (SBMRI, San Diego, C...
In DepthDetails PCBioAssay