BDBM481083 US10906890, Example 95.0
SMILES CO[C@@H]([C@H](C)S(=O)(=O)Nc1nnc(-c2cccc3cnccc23)n1-c1c(OC)cccc1OC)c1ncc(C)cn1
InChI Key InChIKey=PLUZSSOPNUZBKI-BVZFJXPGSA-N
Data  1 EC50
  Tab Delimited (TSV)   2D SDfile   Computed 3D by Vconf -m prep SDfile
Find this compound or compounds like it in BindingDB:
Activity Spreadsheet -- Enzyme Inhibition Constant Data from BindingDB
Found 1 hit for monomerid = 481083
TargetApelin receptor(Homo sapiens (Human))
Amgen
US Patent
LigandPNGBDBM481083(US10906890, Example 95.0)
Affinity DataEC50:  340nM. Assay description: The human APJ receptor was cloned by polymerase chain reaction and the gene encoding the receptor was subcloned in pFLAG-CMV™-3 expression vector (Si...
Ligand InfoPC cidPC sid
In DepthDetails US Patent