BDBM481103 US10906890, Example 129.0
SMILES COCCn1c(NS(=O)(=O)[C@@H](C)[C@H](OC)c2ncc(Cl)cn2)nnc1-c1ccccc1
InChI Key InChIKey=UWKLZOFSDPHROH-BBRMVZONSA-N
Data  1 EC50
  Tab Delimited (TSV)   2D SDfile   Computed 3D by Vconf -m prep SDfile
Find this compound or compounds like it in BindingDB:
Activity Spreadsheet -- Enzyme Inhibition Constant Data from BindingDB
Found 1 hit for monomerid = 481103
TargetApelin receptor(Homo sapiens (Human))
Amgen
US Patent
LigandPNGBDBM481103(US10906890, Example 129.0)
Affinity DataEC50:  14nM. Assay description: The human APJ receptor was cloned by polymerase chain reaction and the gene encoding the receptor was subcloned in pFLAG-CMV™-3 expression vector (Si...
Ligand InfoPC cidPC sid
In DepthDetails US Patent