BDBM48120 1-(4-methoxyphenyl)-N-prop-2-enyl-4-pyrazolo[3,4-d]pyrimidinamine::1-(4-methoxyphenyl)-N-prop-2-enyl-pyrazolo[3,4-d]pyrimidin-4-amine::1-(4-methoxyphenyl)-N-prop-2-enylpyrazolo[3,4-d]pyrimidin-4-amine::MLS000036778::SMR000035743::allyl-[1-(4-methoxyphenyl)pyrazolo[3,4-d]pyrimidin-4-yl]amine::cid_661248
SMILES COc1ccc(cc1)-n1ncc2c(NCC=C)ncnc12
InChI Key InChIKey=NGJWODCXMUHRGF-UHFFFAOYSA-N
Data  1 EC50
  Tab Delimited (TSV)   2D SDfile   Computed 3D by Vconf -m prep SDfile
Find this compound or compounds like it in BindingDB:
Activity Spreadsheet -- Enzyme Inhibition Constant Data from BindingDB
Found 1 hit for monomerid = 48120
TargetMatrix metalloproteinase-14 [1-36](Homo sapiens (Human))
Sanford-Burnham Center For Chemical Genomics
Curated by PubChem BioAssay
LigandPNGBDBM48120(1-(4-methoxyphenyl)-N-prop-2-enyl-4-pyrazolo[3,4-d...)
Affinity DataEC50:  8.50E+3nM. Assay description: Data Source: Sanford-Burnham Center for Chemical Genomics (SBCCG) Source Affiliation: Sanford-Burnham Medical Research Institute (SBMRI, San Diego, C...
In DepthDetails PCBioAssay