BDBM48125 2-[(3,5-dimethyl-1,2-oxazol-4-yl)methylsulfanyl]-6-ethyl-3-(furan-2-ylmethyl)thieno[2,3-d]pyrimidin-4-one::2-[(3,5-dimethyl-4-isoxazolyl)methylthio]-6-ethyl-3-(2-furanylmethyl)-4-thieno[2,3-d]pyrimidinone::2-[(3,5-dimethylisoxazol-4-yl)methylthio]-6-ethyl-3-(2-furfuryl)thieno[2,3-d]pyrimidin-4-one::MLS000098667::SMR000068699::cid_2571817
SMILES CCc1cc2c(nc(SCc3c(C)noc3C)n(Cc3ccco3)c2=O)s1
InChI Key InChIKey=YNXMUUVYVNXPMH-UHFFFAOYSA-N
Data  1 IC50  1 EC50
  Tab Delimited (TSV)   2D SDfile   Computed 3D by Vconf -m prep SDfile
Find this compound or compounds like it in BindingDB:
Activity Spreadsheet -- Enzyme Inhibition Constant Data from BindingDB
Found 2 hits for monomerid = 48125
TargetGenome polyprotein(Hepatitis C virus)
The Scripps Research Institute Molecular Screening Center
Curated by PubChem BioAssay
LigandPNGBDBM48125(2-[(3,5-dimethyl-1,2-oxazol-4-yl)methylsulfanyl]-6...)
Affinity DataIC50:  2.56E+4nM. Assay description: Source (MLPCN Center Name): The Scripps Research Institute Molecular Screening Center (SRIMSC) Center Affiliation: The Scripps Research Institute (TS...
In DepthDetails PCBioAssay
TargetMatrix metalloproteinase-14 [1-36](Homo sapiens (Human))
Sanford-Burnham Center For Chemical Genomics
Curated by PubChem BioAssay
LigandPNGBDBM48125(2-[(3,5-dimethyl-1,2-oxazol-4-yl)methylsulfanyl]-6...)
Affinity DataEC50:  5.00E+4nM. Assay description: Data Source: Sanford-Burnham Center for Chemical Genomics (SBCCG) Source Affiliation: Sanford-Burnham Medical Research Institute (SBMRI, San Diego, C...
In DepthDetails PCBioAssay