BDBM481719 US10913733, Example 30
SMILES [#6]-[#7]-[#6](=O)-c1ccc(\[#6]=[#6]-2\[#6]-[#6]-[#7](-[#6]-c3cnc(-[#7]-[#6](-[#6])=O)s3)-[#6]-[#6]-2)cc1
InChI Key InChIKey=MUBGWHRAAGNGIP-UHFFFAOYSA-N
Data  1 KI
  Tab Delimited (TSV)   2D SDfile   Computed 3D by Vconf -m prep SDfile
Find this compound or compounds like it in BindingDB:
Activity Spreadsheet -- Enzyme Inhibition Constant Data from BindingDB
Found 1 hit for monomerid = 481719
TargetProtein O-GlcNAcase(Homo sapiens (Human))
Alectos Therapeutics
US Patent
LigandPNGBDBM481719(US10913733, Example 30)
Affinity DataKi:  0.430nM. Assay description: Experimental procedure for kinetic analyses: Enzymatic reactions were carried out in a reaction containing 50 mM NaH2PO4, 100 mM NaCl and 0.1% BSA (p...
Ligand InfoPC cidPC sid
In DepthDetails US Patent