BDBM481784 7-([4-[2-(4- chlorophenyl)ethyl]-5-oxo- 4,5-dihydro-1,3,4- oxadiazol-2-yl]methyl)-1- methyl-6,7-dihydro-1H- purin-6-one::US10913742, Example 26
SMILES Cn1cnc2ncn(Cc3nn(CCc4ccc(Cl)cc4)c(=O)o3)c2c1=O
InChI Key InChIKey=HGVCMBRPRZORGD-UHFFFAOYSA-N
Data  1 IC50
  Tab Delimited (TSV)   2D SDfile   Computed 3D by Vconf -m prep SDfile
Find this compound or compounds like it in BindingDB:
Activity Spreadsheet -- Enzyme Inhibition Constant Data from BindingDB
Found 1 hit for monomerid = 481784
TargetTransient receptor potential cation channel subfamily A member 1(Homo sapiens (Human))
Genentech
US Patent
LigandPNGBDBM481784(7-([4-[2-(4- chlorophenyl)ethyl]-5-oxo- 4,5-dihydr...)
Affinity DataIC50:  737nM. Assay description: The IC50 (effective concentration) of compounds on the human and rat TRPA1 channels were determined using a FLIPR Tetra instrument. CHO cells express...
Ligand InfoPC cidPC sid
In DepthDetails US Patent