BDBM482056 US10913753, Compound I-123::US10913753, Compound I-216::US10913753, Compound I-217
SMILES Cc1ccc2c(N)c(sc2n1)C(=O)NCCc1ccc(cc1)N1CCC2(C1)CCCNC2
InChI Key InChIKey=UBGTYXOXAHVQFB-UHFFFAOYSA-N
Data  6 IC50
  Tab Delimited (TSV)   2D SDfile   Computed 3D by Vconf -m prep SDfile
Find this compound or compounds like it in BindingDB:
Activity Spreadsheet -- Enzyme Inhibition Constant Data from BindingDB
Found 6 hits for monomerid = 482056
TargetUbiquitin carboxyl-terminal hydrolase 28(Homo sapiens)
Valo Early Discovery
US Patent
LigandPNGBDBM482056(US10913753, Compound I-123 | US10913753, Compound ...)
Affinity DataIC50: <200nM. Assay description: USP28: The assay was performed in a final volume of 20 uL in assay buffer containing 20 mM Tris-HCl (pH 8.0, (1M Tris-HCl, pH 8.0 solution; Corning 4...
Ligand InfoPC cidPC sid
In DepthDetails US Patent
TargetUbiquitin carboxyl-terminal hydrolase 25(Homo sapiens)
Valo Early Discovery
US Patent
LigandPNGBDBM482056(US10913753, Compound I-123 | US10913753, Compound ...)
Affinity DataIC50:  1.10E+3nM. Assay description: USP25: The assay was performed in a final volume of 9 uL in assay buffer containing 20 mM Tris-HCl (pH 8.0, (1M Tris-HC1, pH 8.0 solution; Corning 46...
Ligand InfoPC cidPC sid
In DepthDetails US Patent
TargetUbiquitin carboxyl-terminal hydrolase 25(Homo sapiens)
Valo Early Discovery
US Patent
LigandPNGBDBM482056(US10913753, Compound I-123 | US10913753, Compound ...)
Affinity DataIC50:  1.10E+3nM. Assay description: USP25: The assay was performed in a final volume of 9 uL in assay buffer containing 20 mM Tris-HCl (pH 8.0, (1M Tris-HC1, pH 8.0 solution; Corning 46...
Ligand InfoPC cidPC sid
In DepthDetails US Patent
TargetUbiquitin carboxyl-terminal hydrolase 25(Homo sapiens)
Valo Early Discovery
US Patent
LigandPNGBDBM482056(US10913753, Compound I-123 | US10913753, Compound ...)
Affinity DataIC50:  1.10E+3nM. Assay description: USP25: The assay was performed in a final volume of 9 uL in assay buffer containing 20 mM Tris-HCl (pH 8.0, (1M Tris-HC1, pH 8.0 solution; Corning 46...
Ligand InfoPC cidPC sid
In DepthDetails US Patent
TargetUbiquitin carboxyl-terminal hydrolase 28(Homo sapiens)
Valo Early Discovery
US Patent
LigandPNGBDBM482056(US10913753, Compound I-123 | US10913753, Compound ...)
Affinity DataIC50:  1.10E+3nM. Assay description: USP28: The assay was performed in a final volume of 20 uL in assay buffer containing 20 mM Tris-HCl (pH 8.0, (1M Tris-HCl, pH 8.0 solution; Corning 4...
Ligand InfoPC cidPC sid
In DepthDetails US Patent
TargetUbiquitin carboxyl-terminal hydrolase 28(Homo sapiens)
Valo Early Discovery
US Patent
LigandPNGBDBM482056(US10913753, Compound I-123 | US10913753, Compound ...)
Affinity DataIC50:  1.10E+3nM. Assay description: USP28: The assay was performed in a final volume of 20 uL in assay buffer containing 20 mM Tris-HCl (pH 8.0, (1M Tris-HCl, pH 8.0 solution; Corning 4...
Ligand InfoPC cidPC sid
In DepthDetails US Patent