BDBM482229 Cyclohexanesulfonic acid [3-(4-amino-7-methyl-7H-pyrrolo[2,3-d]pyrimidin-5-yl)-2-fluoro-phenyl]-amide ::US10918642, Cmpd # 89::US11491158, Cmpd 89
SMILES Cn1cc(-c2cccc(NS(=O)(=O)C3CCCCC3)c2F)c2c(N)ncnc12
InChI Key InChIKey=TUYXBQNRMZCKPH-UHFFFAOYSA-N
Data  2 IC50
  Tab Delimited (TSV)   2D SDfile   Computed 3D by Vconf -m prep SDfile
Find this compound or compounds like it in BindingDB:
Activity Spreadsheet -- Enzyme Inhibition Constant Data from BindingDB
Found 2 hits for monomerid = 482229
TargetEukaryotic translation initiation factor 2-alpha kinase 3 [540-1115](Homo sapiens (Human))
Nerviano Medical Sciences
US Patent
LigandPNGBDBM482229(Cyclohexanesulfonic acid [3-(4-amino-7-methyl-7H-p...)
Affinity DataIC50: >160nM. Assay description: The biochemical activity of compounds was determined by incubation with PERK recombinant enzyme (cytoplasmic domain corresponding to residues 540-111...
Ligand InfoPC cidPC sid
In DepthDetails US Patent
TargetEukaryotic translation initiation factor 2-alpha kinase 3(Homo sapiens (Human))
Nerviano Medical Sciences
US Patent
LigandPNGBDBM482229(Cyclohexanesulfonic acid [3-(4-amino-7-methyl-7H-p...)
Affinity DataIC50: >160nM. Assay description: Serially diluted compounds were incubated for 60 minutes at room temperature in the presence of ATP/P33 gammaATP mix, substrate and enzyme in a volum...
Ligand InfoPC cidPC sid
In DepthDetails US Patent