BDBM48268 (E)-3-[4-(dimethylamino)anilino]-1-(2-furanyl)-2-propen-1-one::(E)-3-[4-(dimethylamino)anilino]-1-(2-furyl)prop-2-en-1-one::(E)-3-[4-(dimethylamino)anilino]-1-(furan-2-yl)prop-2-en-1-one::(E)-3-[[4-(dimethylamino)phenyl]amino]-1-(furan-2-yl)prop-2-en-1-one::3-{[4-(dimethylamino)phenyl]amino}-1-(2-furyl)-2-propen-1-one::MLS000535594::SMR000143030::cid_1980018
SMILES CN(C)c1ccc(cc1)N=CCC(=O)c1ccco1
InChI Key InChIKey=IDQDVMCOBMDZRF-UHFFFAOYSA-N
Data  1 IC50  2 EC50
  Tab Delimited (TSV)   2D SDfile   Computed 3D by Vconf -m prep SDfile
Find this compound or compounds like it in BindingDB:
Activity Spreadsheet -- Enzyme Inhibition Constant Data from BindingDB
Found 3 hits for monomerid = 48268
TargetMatrix metalloproteinase-14 [1-36](Homo sapiens (Human))
Sanford-Burnham Center For Chemical Genomics
Curated by PubChem BioAssay
LigandPNGBDBM48268((E)-3-[4-(dimethylamino)anilino]-1-(2-furanyl)-2-p...)
Affinity DataEC50:  4.42E+3nM. Assay description: Data Source: Sanford-Burnham Center for Chemical Genomics (SBCCG) Source Affiliation: Sanford-Burnham Medical Research Institute (SBMRI, San Diego, C...
In DepthDetails PCBioAssay
TargetTumor necrosis factor receptor superfamily member 10B(Homo sapiens (Human))
Burnham Center For Chemical Genomics
Curated by PubChem BioAssay
LigandPNGBDBM48268((E)-3-[4-(dimethylamino)anilino]-1-(2-furanyl)-2-p...)
Affinity DataEC50:  7.62E+3nM
In DepthDetails PCBioAssay
TargetProtein skinhead-1(Caenorhabditis elegans)
Burnham Center For Chemical Genomics
Curated by PubChem BioAssay
LigandPNGBDBM48268((E)-3-[4-(dimethylamino)anilino]-1-(2-furanyl)-2-p...)
Affinity DataIC50:  7.05E+4nM
In DepthDetails PCBioAssay