BDBM483415 US10919911, Example 37
SMILES CC1(C)COc2c(NC(=O)c3cc(c(cn3)N3CCOCC3)-n3cnc(c3)C3CC3)cccc2-c2nnnn12
InChI Key InChIKey=MRSITXNNLPBJBO-UHFFFAOYSA-N
Data  1 IC50
  Tab Delimited (TSV)   2D SDfile   Computed 3D by Vconf -m prep SDfile
Find this compound or compounds like it in BindingDB:
Activity Spreadsheet -- Enzyme Inhibition Constant Data from BindingDB
Found 1 hit for monomerid = 483415
TargetMitogen-activated protein kinase kinase kinase 5(Homo sapiens (Human))
Terns
US Patent
LigandPNGBDBM483415(US10919911, Example 37)
Affinity DataIC50:  0.5nM. Assay description: Base Reaction buffer: 20 mM Hepes (pH 7.5), 10 mM MgCl2, 1 mM EGTA, 0.02% Brij35, 0.02 mg/ml BSA, 0.1 mM Na3VO4, 2 mM DTT, and 1% DMSO were used for ...
Ligand InfoPC cidPC sid
In DepthDetails US Patent