BDBM483512 US10927076, Compound Table2.NH2
SMILES CC(C)c1cc(C(=O)N2Cc3ccccc3C2)c(O)cc1N
InChI Key InChIKey=XULNRTYXBNAXPC-UHFFFAOYSA-N
Data  2 Kd
  Tab Delimited (TSV)   2D SDfile   Computed 3D by Vconf -m prep SDfile
Find this compound or compounds like it in BindingDB:
Activity Spreadsheet -- Enzyme Inhibition Constant Data from BindingDB
Found 2 hits for monomerid = 483512
TargetHeat shock protein HSP 90-alpha(Homo sapiens (Human))
University Of Kansas
US Patent
LigandPNGBDBM483512(US10927076, Compound Table2.NH2)
Affinity DataKd:  460nM. Assay description: Assay was performed in 96-well format in black, flat bottom plates (Santa Cruz Biotechnology) with a final volume of 100 μL. 25 μL of assay...
Ligand InfoPC cidPC sid
In DepthDetails US Patent
TargetHeat shock protein HSP 90-beta(Homo sapiens (Human))
University Of Kansas
US Patent
LigandPNGBDBM483512(US10927076, Compound Table2.NH2)
Affinity DataKd:  710nM. Assay description: Assay was performed in 96-well format in black, flat bottom plates (Santa Cruz Biotechnology) with a final volume of 100 μL. 25 μL of assay...
Ligand InfoPC cidPC sid
In DepthDetails US Patent