BDBM483606 US10927079, Compound 41b
SMILES Cc1nnc(CNC(=O)c2nc(c(NC(=O)N[C@H]3[C@@H](O)CC(C)(C)c4cc(F)c(F)cc34)cc2C)-c2ccccc2)o1
InChI Key InChIKey=BJXIGPBXAXVYLX-WNCULLNHSA-N
Data  1 IC50
  Tab Delimited (TSV)   2D SDfile   Computed 3D by Vconf -m prep SDfile
Find this compound or compounds like it in BindingDB:
Activity Spreadsheet -- Enzyme Inhibition Constant Data from BindingDB
Found 1 hit for monomerid = 483606
TargetHigh affinity nerve growth factor receptor(Homo sapiens (Human))
Mochida Pharmaceutical
US Patent
LigandPNGBDBM483606(US10927079, Compound 41b)
Affinity DataIC50: <0.100nM. Assay description: Measurement was carried out using TrkA LanthaScreen (registered trademark) Eu Kinase Binding Assay (ThermoFisher SCIENTIFIC). To a 384 well plate (Co...
Ligand InfoPC cidPC sid
In DepthDetails US Patent