BDBM483697 1-(2-(5-chloro-2- (trifluoromethyl)- benzyl)-2,8- diazaspiro[4.5]- decane-8- carbonyl)-4- (trifluoromethyl)- 1H-pyrazole-3- carboxylic acid::US10927105, Ex 148::US11655217, Example 148
SMILES OC(=O)c1nn(cc1C(F)(F)F)C(=O)N1CCC2(CCN(Cc3cc(Cl)ccc3C(F)(F)F)C2)CC1
InChI Key InChIKey=FUPSQSSGYVHHAH-UHFFFAOYSA-N
Data  4 IC50
  Tab Delimited (TSV)   2D SDfile   Computed 3D by Vconf -m prep SDfile
Find this compound or compounds like it in BindingDB:
Activity Spreadsheet -- Enzyme Inhibition Constant Data from BindingDB
Found 4 hits for monomerid = 483697
TargetMonoglyceride lipase(Homo sapiens (Human))
Lundbeck La Jolla Research Center
US Patent
LigandPNGBDBM483697(1-(2-(5-chloro-2- (trifluoromethyl)- benzyl)-2,8- ...)
Affinity DataIC50: <100nM. Assay description: Proteomes (mouse brain membrane fraction for mouse assays; human prefrontal cortex membrane fractions for human assays) (50 mL, 1.0 mg/mL total prote...
Ligand InfoPC cidPC sid
In DepthDetails US Patent
TargetFatty-acid amide hydrolase 1(Homo sapiens (Human))
H. Lundbeck
US Patent
LigandPNGBDBM483697(1-(2-(5-chloro-2- (trifluoromethyl)- benzyl)-2,8- ...)
Affinity DataIC50:  550nM. Assay description: Proteomes (mouse brain membrane fraction for mouse assays; human prefrontal cortex membrane fractions for human assays) (50 mL, 1.0 mg/mL total prote...
Ligand InfoPC cidPC sid
In DepthDetails US Patent
TargetMonoglyceride lipase(Homo sapiens (Human))
Lundbeck La Jolla Research Center
US Patent
LigandPNGBDBM483697(1-(2-(5-chloro-2- (trifluoromethyl)- benzyl)-2,8- ...)
Affinity DataIC50: <100nM. Assay description: Proteomes (mouse brain membrane fraction for mouse assays; human prefrontal cortex membrane fractions for human assays) (50 mL, 1.0 mg/mL total prote...
Ligand InfoPC cidPC sid
In DepthDetails US Patent
TargetFatty acid 2-hydroxylase(Human)
Lundbeck La Jolla Research Center
US Patent
LigandPNGBDBM483697(1-(2-(5-chloro-2- (trifluoromethyl)- benzyl)-2,8- ...)
Affinity DataIC50:  550nM. Assay description: Proteomes (mouse brain membrane fraction for mouse assays; human prefrontal cortex membrane fractions for human assays) (50 mL, 1.0 mg/mL total prote...
Ligand InfoPC cidPC sid
In DepthDetails US Patent