BDBM483700 1-(trans-5-((3- (trifluoromethyl)- benzyl)oxy)- octahydrocyclopenta- [c]pyrrole- 2-carbonyl)-1H- pyrazole-3- carboxylic acid::US10927105, Ex 157::US11655217, Example 157
SMILES OC(=O)c1ccn(n1)C(=O)N1C[C@@H]2C[C@H](C[C@@H]2C1)OCc1cccc(c1)C(F)(F)F
InChI Key InChIKey=SNYMOYNHOLZNKT-FOLVSLTJSA-N
Data  4 IC50
  Tab Delimited (TSV)   2D SDfile   Computed 3D by Vconf -m prep SDfile
Find this compound or compounds like it in BindingDB:
Activity Spreadsheet -- Enzyme Inhibition Constant Data from BindingDB
Found 4 hits for monomerid = 483700
TargetMonoglyceride lipase(Homo sapiens (Human))
Lundbeck La Jolla Research Center
US Patent
LigandPNGBDBM483700(1-(trans-5-((3- (trifluoromethyl)- benzyl)oxy)- oc...)
Affinity DataIC50: <100nM. Assay description: Proteomes (mouse brain membrane fraction for mouse assays; human prefrontal cortex membrane fractions for human assays) (50 mL, 1.0 mg/mL total prote...
Ligand InfoPC cidPC sid
In DepthDetails US Patent
TargetFatty-acid amide hydrolase 1(Homo sapiens (Human))
H. Lundbeck
US Patent
LigandPNGBDBM483700(1-(trans-5-((3- (trifluoromethyl)- benzyl)oxy)- oc...)
Affinity DataIC50:  550nM. Assay description: Proteomes (mouse brain membrane fraction for mouse assays; human prefrontal cortex membrane fractions for human assays) (50 mL, 1.0 mg/mL total prote...
Ligand InfoPC cidPC sid
In DepthDetails US Patent
TargetMonoglyceride lipase(Homo sapiens (Human))
Lundbeck La Jolla Research Center
US Patent
LigandPNGBDBM483700(1-(trans-5-((3- (trifluoromethyl)- benzyl)oxy)- oc...)
Affinity DataIC50: <100nM. Assay description: Proteomes (mouse brain membrane fraction for mouse assays; human prefrontal cortex membrane fractions for human assays) (50 mL, 1.0 mg/mL total prote...
Ligand InfoPC cidPC sid
In DepthDetails US Patent
TargetFatty acid 2-hydroxylase(Human)
Lundbeck La Jolla Research Center
US Patent
LigandPNGBDBM483700(1-(trans-5-((3- (trifluoromethyl)- benzyl)oxy)- oc...)
Affinity DataIC50:  550nM. Assay description: Proteomes (mouse brain membrane fraction for mouse assays; human prefrontal cortex membrane fractions for human assays) (50 mL, 1.0 mg/mL total prote...
Ligand InfoPC cidPC sid
In DepthDetails US Patent