BDBM483809 (R)-1-(2-methyl-4- (2-(pyrrolidin-1-yl)- 4-(trifluoromethyl)- benzyl)- piperazine-1- carbonyl)-1H- pyrazole-3- carboxylic acid::US10927105, Ex 327::US11655217, Example 327
SMILES C[C@@H]1CN(Cc2ccc(cc2N2CCCC2)C(F)(F)F)CCN1C(=O)n1ccc(n1)C(O)=O
InChI Key InChIKey=LOZHXFCOGJLKLL-OAHLLOKOSA-N
Data  2 IC50
  Tab Delimited (TSV)   2D SDfile   Computed 3D by Vconf -m prep SDfile
Find this compound or compounds like it in BindingDB:
Activity Spreadsheet -- Enzyme Inhibition Constant Data from BindingDB
Found 2 hits for monomerid = 483809
TargetMonoglyceride lipase(Homo sapiens (Human))
H. Lundbeck
US Patent
LigandPNGBDBM483809((R)-1-(2-methyl-4- (2-(pyrrolidin-1-yl)- 4-(triflu...)
Affinity DataIC50: <100nM. Assay description: Proteomes (mouse brain membrane fraction for mouse assays; human prefrontal cortex membrane fractions for human assays) (50 mL, 1.0 mg/mL total prote...
Ligand InfoPC cidPC sid
In DepthDetails US Patent
TargetMonoglyceride lipase(Homo sapiens (Human))
H. Lundbeck
US Patent
LigandPNGBDBM483809((R)-1-(2-methyl-4- (2-(pyrrolidin-1-yl)- 4-(triflu...)
Affinity DataIC50: <100nM. Assay description: Proteomes (mouse brain membrane fraction for mouse assays; human prefrontal cortex membrane fractions for human assays) (50 mL, 1.0 mg/mL total prote...
Ligand InfoPC cidPC sid
In DepthDetails US Patent