BDBM484014 N-(4-methyl-3-(7-methyl-2- (methylamino)pyrido[2,3-d]pyrimidin- 6-yl)phenyl)-6- (trifluoromethyl)pyridazine-4- carboxamide::US10927111, Example 50::US11667634, Example 50
SMILES CNc1ncc2cc(c(C)nc2n1)-c1cc(NC(=O)c2cnnc(c2)C(F)(F)F)ccc1C
InChI Key InChIKey=CWPBTPDWFAVXSG-UHFFFAOYSA-N
Data  2 IC50
  Tab Delimited (TSV)   2D SDfile   Computed 3D by Vconf -m prep SDfile
Find this compound or compounds like it in BindingDB:
Activity Spreadsheet -- Enzyme Inhibition Constant Data from BindingDB
Found 2 hits for monomerid = 484014
TargetRAF proto-oncogene serine/threonine-protein kinase(Homo sapiens (Human))
Kinnate Biopharma
US Patent
LigandPNGBDBM484014(N-(4-methyl-3-(7-methyl-2- (methylamino)pyrido[2,3...)
Affinity DataIC50: <0.100nM. Assay description: Protein kinase assay: Assay platform was used to measure kinase/inhibitor interactions as described previously (Anastassiadis et al., 2011). In brief...
Ligand InfoPC cidPC sid
In DepthDetails US Patent
TargetRAF proto-oncogene serine/threonine-protein kinase(Homo sapiens (Human))
Kinnate Biopharma
US Patent
LigandPNGBDBM484014(N-(4-methyl-3-(7-methyl-2- (methylamino)pyrido[2,3...)
Affinity DataIC50: <10nM. Assay description: Protein kinase assay: Assay platform was used to measure kinase/inhibitor interactions as described previously (Anastassiadis et al., 2011). In brief...
Ligand InfoPC cidPC sid
In DepthDetails US Patent