BDBM484265 (S)-1-(2-(1-(4-(2-fluoro-3- methoxyphenoxy)phenyl)-5,8- dimethylimidazo[1,5-a]pyrazin-3- yl)pyrrolidin-1-yl)prop-2-en-1-one::US10933063, Compound 64::US11554118, Compound 64
SMILES COc1cccc(Oc2ccc(cc2)-c2nc([C@@H]3CCCN3C(=O)C=C)n3c(C)cnc(C)c23)c1F
InChI Key InChIKey=RIAQUKQQWBGILP-NRFANRHFSA-N
Data  2 IC50
  Tab Delimited (TSV)   2D SDfile   Computed 3D by Vconf -m prep SDfile
Find this compound or compounds like it in BindingDB:
Activity Spreadsheet -- Enzyme Inhibition Constant Data from BindingDB
Found 2 hits for monomerid = 484265
TargetTyrosine-protein kinase BTK(Homo sapiens (Human))
Suzhou Baijibugong Pharmaceutical Technology
US Patent
LigandPNGBDBM484265((S)-1-(2-(1-(4-(2-fluoro-3- methoxyphenoxy)phenyl)...)
Affinity DataIC50: <10nM. Assay description: Btk kinase activity was determined using a homogenous time resolved fluorescence (HTRF) methodology. Measurements were performed in a reaction volume...
Ligand InfoPC cidPC sid
In DepthDetails ArticleUS Patent
TargetTyrosine-protein kinase BTK(Homo sapiens (Human))
Suzhou Baijibugong Pharmaceutical Technology
US Patent
LigandPNGBDBM484265((S)-1-(2-(1-(4-(2-fluoro-3- methoxyphenoxy)phenyl)...)
Affinity DataIC50:  30nM. Assay description: Btk and Other Kinases: Btk kinase activity was determined using a homogenous time resolved fluorescence (HTRF) methodology. Measurements were perform...
Ligand InfoPC cidPC sid
In DepthDetails US Patent