BDBM484433 US10934285, Example 17
SMILES NCC1CCN(C1)c1cnc(Sc2cccc(NC(=O)c3c(O)nc4ccccn4c3=O)c2Cl)c(N)n1
InChI Key InChIKey=TUXLLVWHNQCYLI-UHFFFAOYSA-N
Data  1 IC50
  Tab Delimited (TSV)   2D SDfile   Computed 3D by Vconf -m prep SDfile
Find this compound or compounds like it in BindingDB:
Activity Spreadsheet -- Enzyme Inhibition Constant Data from BindingDB
Found 1 hit for monomerid = 484433
TargetSH2B adapter protein 2(Human)
Novartis
US Patent
LigandPNGBDBM484433(US10934285, Example 17)
Affinity DataIC50:  13nM. Assay description: The inhibition of SHP2 by compounds of the invention (concentrations varying from 0.003-100 μM) was monitored using an assay in which 0.5 nM of ...
Ligand InfoPC cidPC sid
In DepthDetails US Patent