BDBM485725 3-(isoquinolin-5-yloxy)-N- methyl-3-(pyridin-2- yl)propan-1-amine::US10941138, Example 23
SMILES CNCCC(Oc1cccc2cnccc12)c1ccccn1
InChI Key InChIKey=KOTUVODXNNNLDY-UHFFFAOYSA-N
Data  1 KI
  Tab Delimited (TSV)   2D SDfile   Computed 3D by Vconf -m prep SDfile
Find this compound or compounds like it in BindingDB:
Activity Spreadsheet -- Enzyme Inhibition Constant Data from BindingDB
Found 1 hit for monomerid = 485725
TargetVoltage-dependent calcium channel subunit alpha-2/delta-1(Homo sapiens (Human))
Esteve Pharmaceuticals
US Patent
LigandPNGBDBM485725(3-(isoquinolin-5-yloxy)-N- methyl-3-(pyridin-2- yl...)
Affinity DataKi: >3.00E+3nM. Assay description: Human α2δ-1 enriched membranes (2.5 μg) were incubated with 15 nM of radiolabeled [3H]-Gabapentin in assay buffer containing Hepes-KOH...
Ligand InfoPC cidPC sid
In DepthDetails US Patent