BDBM485774 N-methyl-3-(quinolin-5- yloxy)-3-(thiazol-2- yl)propan-1-amine::US10941138, Example 72
SMILES CNCCC(Oc1cccc2ncccc12)c1nccs1
InChI Key InChIKey=BYXCBFNAGGVRKV-UHFFFAOYSA-N
Data  3 KI
  Tab Delimited (TSV)   2D SDfile   Computed 3D by Vconf -m prep SDfile
Find this compound or compounds like it in BindingDB:
Activity Spreadsheet -- Enzyme Inhibition Constant Data from BindingDB
Found 3 hits for monomerid = 485774
TargetVoltage-dependent calcium channel subunit alpha-2/delta-1(Homo sapiens (Human))
Esteve Pharmaceuticals
US Patent
LigandPNGBDBM485774(N-methyl-3-(quinolin-5- yloxy)-3-(thiazol-2- yl)pr...)
Affinity DataKi:  300nM. Assay description: Human α2δ-1 enriched membranes (2.5 μg) were incubated with 15 nM of radiolabeled [3H]-Gabapentin in assay buffer containing Hepes-KOH...
Ligand InfoPC cidPC sid
In DepthDetails US Patent
TargetVoltage-dependent calcium channel subunit alpha-2/delta-1(Homo sapiens (Human))
Esteve Pharmaceuticals
US Patent
LigandPNGBDBM485774(N-methyl-3-(quinolin-5- yloxy)-3-(thiazol-2- yl)pr...)
Affinity DataKi:  300nM. Assay description: Human α2δ-1 enriched membranes (2.5 μg) were incubated with 15 nM of radiolabeled [3H]-Gabapentin in assay buffer containing Hepes-KOH...
Ligand InfoPC cidPC sid
In DepthDetails US Patent
TargetNeuroepithelial cell-transforming gene 1 protein(Homo sapiens)
Esteve Pharmaceuticals
US Patent
LigandPNGBDBM485774(N-methyl-3-(quinolin-5- yloxy)-3-(thiazol-2- yl)pr...)
Affinity DataKi:  750nM. Assay description: Human norepinephrine transporter (NET) enriched membranes (5 μg) were incubated with 5 nM of radiolabeled [3H]-Nisoxetin in assay buffer contain...
Ligand InfoPC cidPC sid
In DepthDetails US Patent