BDBM485791 (R)-5-(3-(ethylamino)-1- (thiophen-2- yl)propoxy)isoquinoline-1- carbonitrile::US10941138, Example 89
SMILES CCNCC[C@@H](Oc1cccc2c(nccc12)C#N)c1cccs1
InChI Key InChIKey=NJLDYVHHIWQBKE-GOSISDBHSA-N
Data  1 KI
  Tab Delimited (TSV)   2D SDfile   Computed 3D by Vconf -m prep SDfile
Find this compound or compounds like it in BindingDB:
Activity Spreadsheet -- Enzyme Inhibition Constant Data from BindingDB
Found 1 hit for monomerid = 485791
TargetVoltage-dependent calcium channel subunit alpha-2/delta-1(Homo sapiens (Human))
Esteve Pharmaceuticals
US Patent
LigandPNGBDBM485791((R)-5-(3-(ethylamino)-1- (thiophen-2- yl)propoxy)i...)
Affinity DataKi: <100nM. Assay description: Human α2δ-1 enriched membranes (2.5 μg) were incubated with 15 nM of radiolabeled [3H]-Gabapentin in assay buffer containing Hepes-KOH...
Ligand InfoPC cidPC sid
In DepthDetails US Patent